Target
Sodium-dependent noradrenaline transporter
Ligand
BDBM50337911
Substrate
Meas. Tech.
ChEMBL_726960 (CHEMBL1686749)
IC50
7±n/a nM
Citation
 Shao, LHewitt, MCWang, FMalcolm, SCMa, JCampbell, JECampbell, UCEngel, SRSpicer, NAHardy, LWSchreiber, RSpear, KLVarney, MA Discovery of N-methyl-1-(1-phenylcyclohexyl)ethanamine, a novel triple serotonin, norepinephrine and dopamine reuptake inhibitor. Bioorg Med Chem Lett 21:1434-7 (2011)  
Target
Name:
Sodium-dependent noradrenaline transporter
Synonyms:
Monoamine transporter NET Noradrenaline Transporter (NET) Norepinephrine transporter protein (NET) SLC6A2 Sodium-dependent noradrenaline transporter (NET) | Solute carrier family 6 member 2
Type:
Multi-pass membrane protein
Mol. Mass.:
69337.72
Organism:
Homo sapiens (Human)
Description:
P23975
Residue:
617
  
Inhibitor
Name:
BDBM50337911
Synonyms:
(+/-)-1-(1-(3,4-dichlorophenyl)cyclohexyl)-N,N-dimethylethanamine CHEMBL1684047 US10562878, Compound 43
Type:
Small organic molecule
Emp. Form.:
C16H23Cl2N
Mol. Mass.:
300.267
SMILES:
CC(N(C)C)C1(CCCCC1)c1ccc(Cl)c(Cl)c1
: