Target
Prostaglandin D2 receptor 2
Ligand
BDBM50338159
Substrate
Meas. Tech.
ChEMBL_727759 (CHEMBL1686118)
IC50
45000±n/a nM
Citation
 Bonafoux, DAbibi, ABettencourt, BBurchat, AEricsson, AHarris, CMKebede, TMorytko, MMcPherson, MWallace, GWu, X Thienopyrrole acetic acids as antagonists of the CRTH2 receptor. Bioorg Med Chem Lett 21:1861-4 (2011)  
Target
Name:
Prostaglandin D2 receptor 2
Synonyms:
CD_antigen=CD294 Chemoattractant Receptor-homologous molecule expressed on T-helper type 2 cells (CRTH2) Chemoattractant receptor-homologous molecule expressed on Th2 cells (CRTH2) G protein-coupled receptor 44 GPR44 PTGDR2 Prostaglandin D2 receptor 2 | Prostaglandin D2 receptor 2 (PGD2)
Type:
Enzyme
Mol. Mass.:
43295.45
Organism:
Homo sapiens (Human)
Description:
Q9Y5Y4
Residue:
395
  
Inhibitor
Name:
BDBM50338159
Synonyms:
2-(6-(2-chloro-4-(methylsulfonyl)benzyl)-5-methyl-6H-thieno[2,3-b]pyrrol-4-yl)acetic acid | CHEMBL1684728
Type:
Small organic molecule
Emp. Form.:
C17H16ClNO4S2
Mol. Mass.:
397.896
SMILES:
Cc1c(CC(O)=O)c2ccsc2n1Cc1ccc(cc1Cl)S(C)(=O)=O
: