Target
Prostaglandin D2 receptor 2
Ligand
BDBM50338163
Substrate
Meas. Tech.
ChEMBL_727754 (CHEMBL1686113)
IC50
330±n/a nM
Citation
 Bonafoux, DAbibi, ABettencourt, BBurchat, AEricsson, AHarris, CMKebede, TMorytko, MMcPherson, MWallace, GWu, X Thienopyrrole acetic acids as antagonists of the CRTH2 receptor. Bioorg Med Chem Lett 21:1861-4 (2011)  
Target
Name:
Prostaglandin D2 receptor 2
Synonyms:
CD_antigen=CD294 Chemoattractant Receptor-homologous molecule expressed on T-helper type 2 cells (CRTH2) Chemoattractant receptor-homologous molecule expressed on Th2 cells (CRTH2) G protein-coupled receptor 44 GPR44 PTGDR2 Prostaglandin D2 receptor 2 | Prostaglandin D2 receptor 2 (PGD2)
Type:
Enzyme
Mol. Mass.:
43295.45
Organism:
Homo sapiens (Human)
Description:
Q9Y5Y4
Residue:
395
  
Inhibitor
Name:
BDBM50338163
Synonyms:
2-(6-(2-chloro-4-(methylsulfonyl)benzyl)-2,5-dimethyl-6H-thieno[2,3-b]pyrrol-4-yl)acetic acid | CHEMBL1684732
Type:
Small organic molecule
Emp. Form.:
C18H18ClNO4S2
Mol. Mass.:
411.923
SMILES:
Cc1cc2c(CC(O)=O)c(C)n(Cc3ccc(cc3Cl)S(C)(=O)=O)c2s1
: