Target
Glucocorticoid receptor
Ligand
BDBM50338313
Substrate
Meas. Tech.
ChEMBL_728113 (CHEMBL1687055)
IC50
16±n/a nM
Citation
 Hudson, ARHiguchi, RIRoach, SLAdams, MEVassar, ASyka, PMMais, DEMiner, JNMarschke, KBZhi, L Discovery of orally available tetrahydroquinoline-based glucocorticoid receptor agonists. Bioorg Med Chem Lett 21:1697-700 (2011)  
Target
Name:
Glucocorticoid receptor
Synonyms:
GCR_HUMAN GRL Glucocorticoid receptor (GRFP) Nuclear receptor subfamily 3 group C member 1
Type:
Enzyme
Mol. Mass.:
85656.87
Organism:
Homo sapiens (Human)
Description:
P04150
Residue:
777
  
Inhibitor
Name:
BDBM50338313
Synonyms:
(+/-)-3-((3R,4S)-3-hydroxy-6-(1H-indol-7-yl)-2,2,4,8-tetramethyl-1,2,3,4-tetrahydroquinolin-5-yl)acrylonitrile | CHEMBL1682428
Type:
Small organic molecule
Emp. Form.:
C24H25N3O
Mol. Mass.:
371.4748
SMILES:
C[C@@H]1[C@@H](O)C(C)(C)Nc2c(C)cc(c(\C=C\C#N)c12)-c1cccc2cc[nH]c12
: