Target
Glucocorticoid receptor
Ligand
BDBM50338319
Substrate
Meas. Tech.
ChEMBL_728108 (CHEMBL1687050)
Ki
319±n/a nM
Citation
 Hudson, ARHiguchi, RIRoach, SLAdams, MEVassar, ASyka, PMMais, DEMiner, JNMarschke, KBZhi, L Discovery of orally available tetrahydroquinoline-based glucocorticoid receptor agonists. Bioorg Med Chem Lett 21:1697-700 (2011)  
Target
Name:
Glucocorticoid receptor
Synonyms:
GCR_HUMAN GRL Glucocorticoid receptor (GRFP) Nuclear receptor subfamily 3 group C member 1
Type:
Enzyme
Mol. Mass.:
85656.87
Organism:
Homo sapiens (Human)
Description:
P04150
Residue:
777
  
Inhibitor
Name:
BDBM50338319
Synonyms:
(+/-)-3-hydroxy-6-(1H-indol-7-yl)-2,2,4,8-tetramethyl-1,2,3,4-tetrahydroquinoline-5-carbaldehyde oxime | CHEMBL1682422
Type:
Small organic molecule
Emp. Form.:
C22H25N3O2
Mol. Mass.:
363.4528
SMILES:
C[C@@H]1[C@@H](O)C(C)(C)Nc2c(C)cc(c(CN=O)c12)-c1cccc2cc[nH]c12
: