Target
Dipeptidyl peptidase 3
Ligand
BDBM50338518
Substrate
Meas. Tech.
ChEMBL_728475 (CHEMBL1685352)
Ki
>30000±n/a nM
Citation
 Andrews, KMBeebe, DABenbow, JWBoyer, DADoran, SDHui, YLiu, SMcPherson, RKNeagu, CParker, JCPiotrowski, DWSchneider, SRTreadway, JLVanVolkenberg, MAZembrowski, WJ 1-((3S,4S)-4-amino-1-(4-substituted-1,3,5-triazin-2-yl) pyrrolidin-3-yl)-5,5-difluoropiperidin-2-one inhibitors of DPP-4 for the treatment of type 2 diabetes. Bioorg Med Chem Lett 21:1810-4 (2011)  
Target
Name:
Dipeptidyl peptidase 3
Synonyms:
DPP3 Dipeptidyl arylamidase III Dipeptidyl peptidase III | Dipeptidyl peptidase III (DPP III)
Type:
Enzyme
Mol. Mass.:
82565.94
Organism:
Homo sapiens (Human)
Description:
Q9NY33
Residue:
737
  
Inhibitor
Name:
BDBM50338518
Synonyms:
1-((3S,4S)-4-amino-1-(4-(3,3-difluoropyrrolidin-1-yl)-1,3,5-triazin-2-yl)pyrrolidin-3-yl)-5,5-difluoropiperidin-2-one | CHEMBL1683571
Type:
Small organic molecule
Emp. Form.:
C16H21F4N7O
Mol. Mass.:
403.3779
SMILES:
N[C@H]1CN(C[C@@H]1N1CC(F)(F)CCC1=O)c1ncnc(n1)N1CCC(F)(F)C1
: