Target
Inosine-5'-monophosphate dehydrogenase 2
Ligand
BDBM50338552
Substrate
Meas. Tech.
ChEMBL_728666 (CHEMBL1685943)
Ki
44±n/a nM
Citation
 Felczak, KChen, LWilson, DWilliams, JVince, RPetrelli, RJayaram, HNKusumanchi, PKumar, MPankiewicz, KW Cofactor-type inhibitors of inosine monophosphate dehydrogenase via modular approach: targeting the pyrophosphate binding sub-domain. Bioorg Med Chem 19:1594-605 (2011)  
Target
Name:
Inosine-5'-monophosphate dehydrogenase 2
Synonyms:
IMDH2_HUMAN IMPD 2 IMPDH-II Inosine 5'-monophosphate dehydrogenase II (IMPDH II) Inosine-5 -monophosphate dehydrogenase 2 | Inosine-5'-monophosphate dehydrogenase (IMPDH)
Type:
Enzyme
Mol. Mass.:
55806.87
Organism:
Homo sapiens (Human)
Description:
Recombinant IMPDH2 expressed in E. coli.
Residue:
514
  
Inhibitor
Name:
BDBM50338552
Synonyms:
6-(-4-(4-((((2S,3R,4S,5S)-5-(6-amino-9H-purin-9-yl)-3,4-dihydroxytetrahydrofuran-2-yl)methoxy)methyl)-1H-1,2,3-triazol-1-yl)-3-methylbut-2-enyl)-7-hydroxy-5-methoxy-4-methylisobenzofuran-1(3H)-one | CHEMBL1683754
Type:
Small organic molecule
Emp. Form.:
C28H33N9O8
Mol. Mass.:
623.6171
SMILES:
COc1c(C)c2COC(=O)c2c(O)c1C\C=C(/C)CNCn1cc(OC[C@@H]2O[C@@H]([C@@H](O)[C@H]2O)n2cnc3c(N)ncnc23)nn1
: