Target
Coagulation factor X
Ligand
BDBM50338692
Substrate
Meas. Tech.
ChEMBL_726871 (CHEMBL1686577)
Ki
4±n/a nM
Citation
 Young, RJAdams, CBlows, MBrown, DBurns-Kurtis, CLChan, CChaudry, LConvery, MADavies, DEExall, AMFoster, GHarling, JDHortense, EIrvine, SIrving, WRJackson, SKleanthous, SPateman, AJPatikis, ANRoethka, TJSenger, SStelman, GJToomey, JRWest, RIWhittaker, CZhou, PWatson, NS Structure and property based design of factor Xa inhibitors: pyrrolidin-2-ones with aminoindane and phenylpyrrolidine P4 motifs. Bioorg Med Chem Lett 21:1582-7 (2011)  
Target
Name:
Coagulation factor X
Synonyms:
Activated coagulation factor X (FXa) Coagulation factor X precursor F10 Factor X heavy chain Factor Xa Stuart-Prower factor
Type:
Enzyme
Mol. Mass.:
54726.60
Organism:
Homo sapiens (Human)
Description:
Residue:
488
  
Inhibitor
Name:
BDBM50338692
Synonyms:
(R/S)-(E)-2-(5-chlorothiophen-2-yl)-N-((3S)-1-(1-(dimethylamino)-2,3-dihydro-1H-inden-5-yl)-2-oxopyrrolidin-3-yl)ethenesulfonamide | CHEMBL1684179
Type:
Small organic molecule
Emp. Form.:
C21H24ClN3O3S2
Mol. Mass.:
466.017
SMILES:
CN(C)C1CCc2cc(ccc12)N1CC[C@H](NS(=O)(=O)\C=C\c2ccc(Cl)s2)C1=O
: