Target
Vasopressin V1b receptor
Ligand
BDBM50338780
Substrate
Meas. Tech.
ChEMBL_727040 (CHEMBL1686964)
IC50
15±n/a nM
Citation
 Napier, SELetourneau, JJAnsari, NAuld, DSBaker, JBest, SCampbell-Wan, LChan, JHCraighead, MDesai, HGoan, KAHo, KKHulskotte, EGMacSweeney, CPMilne, RMorphy, JRNeagu, IOhlmeyer, MHPeeters, AWPresland, JRiviello, CRuigt, GSThomson, FJZanetakos, HAZhao, JWebb, ML Synthesis and SAR studies of novel 2-(4-oxo-2-aryl-quinazolin-3(4H)-yl)acetamide vasopressin V1b receptor antagonists. Bioorg Med Chem Lett 21:1871-5 (2011)  
Target
Name:
Vasopressin V1b receptor
Synonyms:
AVPR V1b AVPR1B Antidiuretic hormone receptor 1b V1bR VPR3 Vasopressin V1b receptor (V1b) Vasopressin V3 receptor
Type:
Enzyme
Mol. Mass.:
46985.01
Organism:
Homo sapiens (Human)
Description:
P47901
Residue:
424
  
Inhibitor
Name:
BDBM50338780
Synonyms:
CHEMBL1684408 | N-(cyclopropylmethyl)-2-(2-(3-methoxyphenyl)-6-(3-morpholinopropoxy)-4-oxoquinazolin-3(4H)-yl)acetamide
Type:
Small organic molecule
Emp. Form.:
C28H34N4O5
Mol. Mass.:
506.5934
SMILES:
COc1cccc(c1)-c1nc2ccc(OCCCN3CCOCC3)cc2c(=O)n1CC(=O)NCC1CC1
: