Target
Vasopressin V1b receptor
Ligand
BDBM50338811
Substrate
Meas. Tech.
ChEMBL_727040 (CHEMBL1686964)
IC50
6±n/a nM
Citation
 Napier, SELetourneau, JJAnsari, NAuld, DSBaker, JBest, SCampbell-Wan, LChan, JHCraighead, MDesai, HGoan, KAHo, KKHulskotte, EGMacSweeney, CPMilne, RMorphy, JRNeagu, IOhlmeyer, MHPeeters, AWPresland, JRiviello, CRuigt, GSThomson, FJZanetakos, HAZhao, JWebb, ML Synthesis and SAR studies of novel 2-(4-oxo-2-aryl-quinazolin-3(4H)-yl)acetamide vasopressin V1b receptor antagonists. Bioorg Med Chem Lett 21:1871-5 (2011)  
Target
Name:
Vasopressin V1b receptor
Synonyms:
AVPR V1b AVPR1B Antidiuretic hormone receptor 1b V1bR VPR3 Vasopressin V1b receptor (V1b) Vasopressin V3 receptor
Type:
Enzyme
Mol. Mass.:
46985.01
Organism:
Homo sapiens (Human)
Description:
P47901
Residue:
424
  
Inhibitor
Name:
BDBM50338811
Synonyms:
2-(2-(3-chlorophenyl)-4-oxo-6-(3-(piperidin-1-yl)propoxy)quinazolin-3(4H)-yl)-N-isopropylacetamide | CHEMBL1684574
Type:
Small organic molecule
Emp. Form.:
C27H33ClN4O3
Mol. Mass.:
497.029
SMILES:
CC(C)NC(=O)Cn1c(nc2ccc(OCCCN3CCCCC3)cc2c1=O)-c1cccc(Cl)c1
: