Target
Xanthine dehydrogenase/oxidase
Ligand
BDBM35440
Substrate
Meas. Tech.
ChEMBL_727225 (CHEMBL1687250)
IC50
8300±n/a nM
Citation
 Nepali, KSingh, GTuran, AAgarwal, ASapra, SKumar, RBanerjee, UCVerma, PKSatti, NKGupta, MKSuri, OPDhar, KL A rational approach for the design and synthesis of 1-acetyl-3,5-diaryl-4,5-dihydro(1H)pyrazoles as a new class of potential non-purine xanthine oxidase inhibitors. Bioorg Med Chem 19:1950-8 (2011)  
Target
Name:
Xanthine dehydrogenase/oxidase
Synonyms:
XDH Xanthine dehydrogenase Xanthine oxidase (XO)
Type:
Protein
Mol. Mass.:
146809.00
Organism:
Bos taurus (Bovine)
Description:
P80457
Residue:
1332
  
Inhibitor
Name:
BDBM35440
Synonyms:
ALLOPURINOL SMR000059083 | cid_2094
Type:
Small organic molecule
Emp. Form.:
C5H4N4O
Mol. Mass.:
136.1115
SMILES:
O=c1[nH]cnc2n[nH]cc12
: