Target
Xanthine dehydrogenase/oxidase
Ligand
BDBM50338858
Substrate
Meas. Tech.
ChEMBL_727225 (CHEMBL1687250)
IC50
81200±n/a nM
Citation
 Nepali, KSingh, GTuran, AAgarwal, ASapra, SKumar, RBanerjee, UCVerma, PKSatti, NKGupta, MKSuri, OPDhar, KL A rational approach for the design and synthesis of 1-acetyl-3,5-diaryl-4,5-dihydro(1H)pyrazoles as a new class of potential non-purine xanthine oxidase inhibitors. Bioorg Med Chem 19:1950-8 (2011)  
Target
Name:
Xanthine dehydrogenase/oxidase
Synonyms:
XDH Xanthine dehydrogenase Xanthine oxidase (XO)
Type:
Protein
Mol. Mass.:
146809.00
Organism:
Bos taurus (Bovine)
Description:
P80457
Residue:
1332
  
Inhibitor
Name:
BDBM50338858
Synonyms:
1-Acetyl-5-(4-hydroxy-3-methoxy)-3-phenyl-4,5-dihydro-((1H)pyrazole | CHEMBL1684637
Type:
Small organic molecule
Emp. Form.:
C18H18N2O3
Mol. Mass.:
310.3471
SMILES:
COc1cc(ccc1O)C1CC(=NN1C(C)=O)c1ccccc1
: