Target
Xanthine dehydrogenase/oxidase
Ligand
BDBM50338871
Substrate
Meas. Tech.
ChEMBL_727225 (CHEMBL1687250)
IC50
76100±n/a nM
Citation
 Nepali, KSingh, GTuran, AAgarwal, ASapra, SKumar, RBanerjee, UCVerma, PKSatti, NKGupta, MKSuri, OPDhar, KL A rational approach for the design and synthesis of 1-acetyl-3,5-diaryl-4,5-dihydro(1H)pyrazoles as a new class of potential non-purine xanthine oxidase inhibitors. Bioorg Med Chem 19:1950-8 (2011)  
Target
Name:
Xanthine dehydrogenase/oxidase
Synonyms:
XDH Xanthine dehydrogenase Xanthine oxidase (XO)
Type:
Protein
Mol. Mass.:
146809.00
Organism:
Bos taurus (Bovine)
Description:
P80457
Residue:
1332
  
Inhibitor
Name:
BDBM50338871
Synonyms:
1-(5-(Benzo[d][1,3]dioxol-6-yl)-4,5-dihydro-3-(3-nitro-(phenyl)pyrazol-1-yl)ethanone | CHEMBL1684646
Type:
Small organic molecule
Emp. Form.:
C18H15N3O5
Mol. Mass.:
353.3288
SMILES:
CC(=O)N1N=C(CC1c1ccc2OCOc2c1)c1cccc(c1)[N+]([O-])=O
: