Target
Squalene synthase
Ligand
BDBM50338925
Substrate
Meas. Tech.
ChEMBL_727292 (CHEMBL1687386)
IC50
1.7±n/a nM
Citation
 Ichikawa, MYokomizo, AItoh, MSugita, KUsui, HShimizu, HSuzuki, MTerayama, KKanda, A Discovery of a new 2-aminobenzhydrol template for highly potent squalene synthase inhibitors. Bioorg Med Chem 19:1930-49 (2011)  
Target
Name:
Squalene synthase
Synonyms:
FDFT1 FPP:FPP farnesyltransferase SQS Squalene synthetase
Type:
PROTEIN
Mol. Mass.:
48114.76
Organism:
Homo sapiens (Human)
Description:
ChEMBL_1352847
Residue:
417
  
Inhibitor
Name:
BDBM50338925
Synonyms:
1-{4-[{4-Chloro-2-[hydroxy(2-methoxyphenyl)methyl]-phenyl}(2,2-dimethylpropyl)amino]-4-oxobutanoyl}piperidine-4-carboxylic acid | CHEMBL1685014
Type:
Small organic molecule
Emp. Form.:
C29H37ClN2O6
Mol. Mass.:
545.067
SMILES:
COc1ccccc1C(O)c1cc(Cl)ccc1N(CC(C)(C)C)C(=O)CCC(=O)N1CCC(CC1)C(O)=O
: