Target
Signal transducer and activator of transcription 3
Ligand
BDBM50338992
Substrate
Meas. Tech.
ChEMBL_729310 (CHEMBL1695665)
IC50
55000±n/a nM
Citation
 Masuda, YSato, HTakahashi, OYokotagawa, TFuruya, TOkawara, TOtsuka, MOgo, NAshizawa, TOshita, CTai, SIshii, HAkiyama, YAsai, A. Identification of a New Series of STAT3 Inhibitors by Virtual Screening. ACS Med Chem Lett 1:371-375 (2010)  
Target
Name:
Signal transducer and activator of transcription 3
Synonyms:
APRF STAT3_HUMAN Signal transducer and activator of transcription 3 (STAT3)
Type:
Protein
Mol. Mass.:
88064.31
Organism:
Homo sapiens (Human)
Description:
P40763
Residue:
770
  
Inhibitor
Name:
BDBM50338992
Synonyms:
CHEMBL1687978 | N-[5-(2-Furyl)-1,3,4-oxadiazol-2-yl]-2-(1-naphthyl)-4-quinolinecarboxamide
Type:
Small organic molecule
Emp. Form.:
C26H16N4O3
Mol. Mass.:
432.4302
SMILES:
O=C(Nc1nnc(o1)-c1ccco1)c1cc(nc2ccccc12)-c1cccc2ccccc12
: