Target
Signal transducer and activator of transcription 3
Ligand
BDBM50338999
Substrate
Meas. Tech.
ChEMBL_729310 (CHEMBL1695665)
IC50
75000±n/a nM
Citation
 Masuda, YSato, HTakahashi, OYokotagawa, TFuruya, TOkawara, TOtsuka, MOgo, NAshizawa, TOshita, CTai, SIshii, HAkiyama, YAsai, A. Identification of a New Series of STAT3 Inhibitors by Virtual Screening. ACS Med Chem Lett 1:371-375 (2010)  
Target
Name:
Signal transducer and activator of transcription 3
Synonyms:
APRF STAT3_HUMAN Signal transducer and activator of transcription 3 (STAT3)
Type:
Protein
Mol. Mass.:
88064.31
Organism:
Homo sapiens (Human)
Description:
P40763
Residue:
770
  
Inhibitor
Name:
BDBM50338999
Synonyms:
2-Phenyl-N-[5-(2-thienyl)-1,3,4-oxadiazol-2-yl)-4-quinolinecarboxamide cid_2104460
Type:
Small organic molecule
Emp. Form.:
C22H14N4O2S
Mol. Mass.:
398.437
SMILES:
O=C(Nc1nnc(o1)-c1cccs1)c1cc(nc2ccccc12)-c1ccccc1
: