Target
Peptidyl-prolyl cis-trans isomerase A
Ligand
BDBM50339005
Substrate
Meas. Tech.
ChEMBL_729492 (CHEMBL1696289)
Ki
106±n/a nM
Citation
 Gaali, SKozany, CHoogeland, BKlein, MHausch, F. Facile synthesis of a fluorescent cyclosporin a analogue to study cyclophilin 40 and cyclophilin 18 ligands. ACS Med Chem Lett 1:536-539 (2010)  
Target
Name:
Peptidyl-prolyl cis-trans isomerase A
Synonyms:
CYPA Cyclophilin A PPIA PPIase A Rotamase A
Type:
Protein
Mol. Mass.:
18015.32
Organism:
Homo sapiens (Human)
Description:
P62937
Residue:
165
  
Inhibitor
Name:
BDBM50339005
Synonyms:
5-(4-((4R,5R,E)-5-((2S,5S,11S,14S,17S,20S,23R,26S,29S,32S)-5-ethyl-11,17,26,29-tetraisobutyl-14,32-diisopropyl-1,7,10,16,20,23,25,28,31-nonamethyl-3,6,9,12,15,18,21,24,27,30,33-undecaoxo-1,4,7,10,13,16,19,22,25,28,31-undecaazacyclotritriacontan-2-yl)-5-hydroxy-4-methylpent-1-enyl)benzylcarbamoyl)-2-(6-hydroxy-3-oxo-3H-xanthen-9-yl)benzoic acid | CHEMBL1688203
Type:
Small organic molecule
Emp. Form.:
C89H126N12O18
Mol. Mass.:
1652.0223
SMILES:
CC[C@@H]1NC(=O)[C@H]([C@H](O)[C@H](C)C\C=C\c2ccc(CNC(=O)c3ccc(c(c3)C(O)=O)-c3c4ccc(O)cc4oc4cc(=O)ccc34)cc2)N(C)C(=O)[C@H](C(C)C)N(C)C(=O)[C@H](CC(C)C)N(C)C(=O)[C@H](CC(C)C)N(C)C(=O)[C@@H](C)NC(=O)[C@H](C)NC(=O)[C@H](CC(C)C)N(C)C(=O)[C@@H](NC(=O)[C@H](CC(C)C)N(C)C(=O)CN(C)C1=O)C(C)C
: