Target
3-phosphoinositide-dependent protein kinase 1
Ligand
BDBM50208879
Substrate
Meas. Tech.
ChEMBL_729497 (CHEMBL1696294)
IC50
50800±n/a nM
Citation
 Medina, JRBlackledge, CWHeerding, DACampobasso, NWard, PBriand, JWright, LAxten, JM. Aminoindazole PDK1 Inhibitors: A Case Study in Fragment-Based Drug Discovery. ACS Med Chem Lett 1:439-442 (2010)  
Target
Name:
3-phosphoinositide-dependent protein kinase 1
Synonyms:
3-Phosphoinositide-Dependent Protein Kinase 1 (PDK1) 3-phosphoinositide-dependent protein kinase 1 3-phosphoinositide-dependent protein kinase 1 (PDK-1) Isoform 2 of 3-phosphoinositide-dependent protein kinase 1 PDPK1 Phosphoinositide-dependent protein kinase 1 (PDK1) hPDK1
Type:
Enzyme
Mol. Mass.:
63157.65
Organism:
Homo sapiens (Human)
Description:
O15530
Residue:
556
  
Inhibitor
Name:
BDBM50208879
Synonyms:
2,6-diaminopurine CHEMBL388596
Type:
Small organic molecule
Emp. Form.:
C5H6N6
Mol. Mass.:
150.1413
SMILES:
Nc1nc(N)c2[nH]cnc2n1
: