Target
3-phosphoinositide-dependent protein kinase 1
Ligand
BDBM50339013
Substrate
Meas. Tech.
ChEMBL_729497 (CHEMBL1696294)
IC50
311000±n/a nM
Citation
 Medina, JRBlackledge, CWHeerding, DACampobasso, NWard, PBriand, JWright, LAxten, JM. Aminoindazole PDK1 Inhibitors: A Case Study in Fragment-Based Drug Discovery. ACS Med Chem Lett 1:439-442 (2010)  
Target
Name:
3-phosphoinositide-dependent protein kinase 1
Synonyms:
3-Phosphoinositide-Dependent Protein Kinase 1 (PDK1) 3-phosphoinositide-dependent protein kinase 1 3-phosphoinositide-dependent protein kinase 1 (PDK-1) Isoform 2 of 3-phosphoinositide-dependent protein kinase 1 PDPK1 Phosphoinositide-dependent protein kinase 1 (PDK1) hPDK1
Type:
Enzyme
Mol. Mass.:
63157.65
Organism:
Homo sapiens (Human)
Description:
O15530
Residue:
556
  
Inhibitor
Name:
BDBM50339013
Synonyms:
1H-indazol-3-amine | CHEMBL1331627
Type:
Small organic molecule
Emp. Form.:
C7H7N3
Mol. Mass.:
133.1506
SMILES:
Nc1[nH]nc2ccccc12
: