Target
Glutathione reductase, mitochondrial
Ligand
BDBM50339129
Substrate
Meas. Tech.
ChEMBL_729212 (CHEMBL1694676)
IC50
7600±n/a nM
Citation
 Sturm, NHu, YZimmermann, HFritz-Wolf, KWittlin, SRahlfs, SBecker, K Compounds structurally related to ellagic acid show improved antiplasmodial activity. Antimicrob Agents Chemother 53:622-30 (2009)  
Target
Name:
Glutathione reductase, mitochondrial
Synonyms:
GLUR GSHR_HUMAN Glutathione reductase | Glutathione reductase (GR)
Type:
Enzyme
Mol. Mass.:
56271.52
Organism:
Homo sapiens (Human)
Description:
P00390
Residue:
522
  
Inhibitor
Name:
BDBM50339129
Synonyms:
CHEMBL1688544 | Coruleoellagic acid
Type:
Small organic molecule
Emp. Form.:
C14H6O10
Mol. Mass.:
334.1914
SMILES:
Oc1c(O)c2oc(=O)c3c(O)c(O)c(O)c4oc(=O)c(c1O)c2c34
: