Target
Protein Mdm4
Ligand
BDBM50339166
Substrate
Meas. Tech.
ChEMBL_735890 (CHEMBL1694394)
IC50
340±n/a nM
Citation
 Madden, MMMuppidi, ALi, ZLi, XChen, JLin, Q Synthesis of cell-permeable stapled peptide dual inhibitors of the p53-Mdm2/Mdmx interactions via photoinduced cycloaddition. Bioorg Med Chem Lett 21:1472-5 (2011)  
Target
Name:
Protein Mdm4
Synonyms:
Double minute 4 protein MDM2-MDMX MDM4_HUMAN Mdm2-like p53-binding protein Protein Mdmx p53-binding protein | p53-binding protein Mdm4
Type:
Oncoprotein
Mol. Mass.:
54842.04
Organism:
Homo sapiens (Human)
Description:
The HDMX(1-188) were expressed in Escherichia coli BL21 (DE3) as a GST fusion and purified on glutathione sepharose.
Residue:
490
  
Inhibitor
Name:
BDBM50339166
Synonyms:
CHEMBL1689398
Type:
Small organic molecule
Emp. Form.:
C89H121N23O20
Mol. Mass.:
1833.0551
SMILES:
COc1ccc(cc1)-n1nnc(n1)C(=O)NCCCC[C@H](NC(=O)[C@H](CC(C)C)NC(=O)[C@H](CCC(N)=O)NC(=O)[C@H](C)NC(=O)[C@H](Cc1c[nH]c2ccccc12)NC(=O)[C@H](Cc1ccc(O)cc1)NC(=O)[C@H](Cc1cnc[nH]1)NC(=O)[C@H](CCCCNC(=O)C(C)=C)NC(=O)[C@H](Cc1ccccc1)NC(=O)[C@@H](NC(=O)[C@H](CC(C)C)NC(C)=O)[C@@H](C)O)C(=O)N[C@@H](CO)C(N)=O
: