Target
Placenta growth factor
Ligand
BDBM50339196
Substrate
Meas. Tech.
ChEMBL_736117 (CHEMBL1692900)
Kd
5±n/a nM
Citation
 Bower, KELam, SNOates, BDDel Rosario, JRCorner, EOsothprarop, TFKinhikar, AGHoye, JAPreston, RRMurphy, RECampbell, LAHuang, HJimenez, JCao, XChen, GAinekulu, ZWDatt, ABLevin, NJDoppalapudi, VRPirie-Shepherd, SRBradshaw, CWoodnutt, GLappe, RW Evolution of potent and stable placental-growth-factor-1-targeting CovX-bodies from phage display peptide discovery. J Med Chem 54:1256-65 (2011)  
Target
Name:
Placenta growth factor
Synonyms:
PGF PLGF | PLGF_HUMAN
Type:
PROTEIN
Mol. Mass.:
24794.98
Organism:
Homo sapiens (Human)
Description:
ChEMBL_942634
Residue:
221
  
Inhibitor
Name:
BDBM50339196
Synonyms:
CHEMBL1689465
Type:
Small organic molecule
Emp. Form.:
C102H144N24O26S2
Mol. Mass.:
2186.51
SMILES:
CC(C)C[C@@H]1NC(=O)[C@@H](NC(=O)[C@@H](NC(=O)[C@H](Cc2c[nH]c3ccccc23)NC(=O)[C@H](CC(N)=O)NC(=O)[C@H](CSSC[C@H](NC(=O)[C@H](Cc2cnc[nH]2)NC(=O)[C@@H]2CCCN2C1=O)C(=O)N[C@@H](CCCCNC(C)=O)C(=O)N[C@@H](C(C)C)C(=O)N[C@@H](CCCCN)C(=O)NC(=O)COCC(=O)Nc1ccc(CCC(=O)N2CCC2=O)cc1)NC(=O)[C@@H](NC(=O)[C@H](CC(O)=O)NC(=O)[C@H](Cc1ccccc1)NC(C)=O)C(C)C)C(C)C)[C@@H](C)O
: