Target
Placenta growth factor
Ligand
BDBM50339209
Substrate
Meas. Tech.
ChEMBL_736117 (CHEMBL1692900)
Kd
0.3±n/a nM
Citation
 Bower, KELam, SNOates, BDDel Rosario, JRCorner, EOsothprarop, TFKinhikar, AGHoye, JAPreston, RRMurphy, RECampbell, LAHuang, HJimenez, JCao, XChen, GAinekulu, ZWDatt, ABLevin, NJDoppalapudi, VRPirie-Shepherd, SRBradshaw, CWoodnutt, GLappe, RW Evolution of potent and stable placental-growth-factor-1-targeting CovX-bodies from phage display peptide discovery. J Med Chem 54:1256-65 (2011)  
Target
Name:
Placenta growth factor
Synonyms:
PGF PLGF | PLGF_HUMAN
Type:
PROTEIN
Mol. Mass.:
24794.98
Organism:
Homo sapiens (Human)
Description:
ChEMBL_942634
Residue:
221
  
Inhibitor
Name:
BDBM50339209
Synonyms:
CHEMBL1689479
Type:
Small organic molecule
Emp. Form.:
C106H146N26O26S2
Mol. Mass.:
2264.582
SMILES:
CC[C@H](C)[C@@H]1NC(=O)[C@H](Cc2ccc(O)cc2)NC(=O)[C@H](Cc2cnc[nH]2)NC(=O)[C@H](CSSC[C@H](NC(=O)[C@H](Cc2cnc[nH]2)NC(=O)[C@@H]2CCCN2C(=O)[C@H](CC(C)C)NC(=O)[C@H](CCCCNC(=O)COCC(=O)Nc2ccc(CCC(=O)N3CCC3=O)cc2)NC1=O)C(=O)N[C@@H]([C@@H](C)O)C(=O)N[C@@H](CCCN=C(N)N)C(=O)N[C@@H](Cc1ccc(O)cc1)C(N)=O)NC(=O)[C@@H](NC(=O)[C@H](CCC(O)=O)NC(=O)[C@H](Cc1ccccc1)NC(C)=O)C(C)C
: