Target
Placenta growth factor
Ligand
BDBM50339191
Substrate
Meas. Tech.
ChEMBL_736103 (CHEMBL1692886)
Kd
400±n/a nM
Citation
 Bower, KELam, SNOates, BDDel Rosario, JRCorner, EOsothprarop, TFKinhikar, AGHoye, JAPreston, RRMurphy, RECampbell, LAHuang, HJimenez, JCao, XChen, GAinekulu, ZWDatt, ABLevin, NJDoppalapudi, VRPirie-Shepherd, SRBradshaw, CWoodnutt, GLappe, RW Evolution of potent and stable placental-growth-factor-1-targeting CovX-bodies from phage display peptide discovery. J Med Chem 54:1256-65 (2011)  
Target
Name:
Placenta growth factor
Synonyms:
PLGF_MOUSE Plgf
Type:
PROTEIN
Mol. Mass.:
17879.06
Organism:
Mus musculus
Description:
ChEMBL_736103
Residue:
158
  
Inhibitor
Name:
BDBM50339191
Synonyms:
CHEMBL1689460
Type:
Small organic molecule
Emp. Form.:
C107H157N25O25S3
Mol. Mass.:
2289.739
SMILES:
CSCC[C@H](NC(=O)[C@@H](NC(=O)[C@H](CCCCN)NC(=O)[C@@H]1CSSC[C@H](NC(=O)[C@@H](NC(=O)[C@H](CC(O)=O)NC(=O)[C@H](Cc2ccccc2)NC(C)=O)C(C)C)C(=O)N[C@@H](CCCCN)C(=O)N[C@@H](Cc2c[nH]c3ccccc23)C(=O)N[C@@H](C(C)C)C(=O)N[C@@H]([C@@H](C)O)C(=O)N[C@@H](CC(C)C)C(=O)N2CCC[C@H]2C(=O)N[C@@H](Cc2cnc[nH]2)C(=O)N1)C(C)C)C(=O)N[C@@H](CCCCN)C(=O)NC(=O)COCC(=O)Nc1ccc(CCC(=O)N2CCC2=O)cc1
: