Target
Proteinase-activated receptor 2
Ligand
BDBM50339247
Substrate
Meas. Tech.
ChEMBL_736225 (CHEMBL1693369)
EC50
3500±n/a nM
Citation
 Boitano, SFlynn, ANSchulz, SMHoffman, JPrice, TJVagner, J Potent agonists of the protease activated receptor 2 (PAR2). J Med Chem 54:1308-13 (2011)  
Target
Name:
Proteinase-activated receptor 2
Synonyms:
F2RL1 PAR2 | PAR2_HUMAN
Type:
PROTEIN
Mol. Mass.:
44152.54
Organism:
Homo sapiens (Human)
Description:
ChEMBL_1497756
Residue:
397
  
Inhibitor
Name:
BDBM50339247
Synonyms:
6-amino-N-((4S,7S,13S,16S)-13-sec-butyl-4-carbamoyl-7-(3-guanidinopropyl)-2,18-dimethyl-6,9,12,15-tetraoxo-5,8,11,14-tetraazanonadecan-16-yl)picolinamide | CHEMBL1689562
Type:
Small organic molecule
Emp. Form.:
C32H55N11O6
Mol. Mass.:
689.8492
SMILES:
[#6]-[#6]-[#6@H](-[#6])-[#6@H](-[#7]-[#6](=O)-[#6@H](-[#6]-[#6](-[#6])-[#6])-[#7]-[#6](=O)-c1cccc(-[#7])n1)-[#6](=O)-[#7]-[#6]-[#6](=O)-[#7]-[#6@@H](-[#6]-[#6]-[#6]\[#7]=[#6](\[#7])-[#7])-[#6](=O)-[#7]-[#6@@H](-[#6]-[#6](-[#6])-[#6])-[#6](-[#7])=O
: