Target
Nucleotide-binding oligomerization domain-containing protein 1
Ligand
BDBM50339297
Substrate
Meas. Tech.
ChEMBL_736315 (CHEMBL1693669)
EC50
0.58±n/a nM
Citation
 Agnihotri, GUkani, RMalladi, SSWarshakoon, HJBalakrishna, RWang, XDavid, SA Structure-activity relationships in nucleotide oligomerization domain 1 (Nod1) agonistic¿-glutamyldiaminopimelic acid derivatives. J Med Chem 54:1490-510 (2011)  
Target
Name:
Nucleotide-binding oligomerization domain-containing protein 1
Synonyms:
CARD4 NOD1_HUMAN | nucleotide-binding oligomerization domain containing 1
Type:
Enzyme Catalytic Domain
Mol. Mass.:
107699.03
Organism:
Homo sapiens (Human)
Description:
gi_5174617
Residue:
953
  
Inhibitor
Name:
BDBM50339297
Synonyms:
2-((R)-4-Carboxy-4-dodecanamidobutanamido)-6-dodecanamidoheptanedioic Acid | CHEMBL1689696
Type:
Small organic molecule
Emp. Form.:
C36H65N3O9
Mol. Mass.:
683.916
SMILES:
CCCCCCCCCCCC(=O)NC(CCCC(NC(=O)CC[C@@H](NC(=O)CCCCCCCCCCC)C(O)=O)C(O)=O)C(O)=O
: