Target
E3 ubiquitin-protein ligase Mdm2
Ligand
BDBM50339387
Substrate
Meas. Tech.
ChEMBL_736488 (CHEMBL1694433)
IC50
>50000±n/a nM
Citation
 Hardcastle, IRLiu, JValeur, EWatson, AAhmed, SUBlackburn, TJBennaceur, KClegg, WDrummond, CEndicott, JAGolding, BTGriffin, RJGruber, JHaggerty, KHarrington, RWHutton, CKemp, SLu, XMcDonnell, JMNewell, DRNoble, MEPayne, SLRevill, CHRiedinger, CXu, QLunec, J Isoindolinone inhibitors of the murine double minute 2 (MDM2)-p53 protein-protein interaction: structure-activity studies leading to improved potency. J Med Chem 54:1233-43 (2011)  
Target
Name:
E3 ubiquitin-protein ligase Mdm2
Synonyms:
Double minute 2 protein E3 ubiquitin-protein ligase Mdm2 (p53-binding protein Mdm2) Human Double Minute 2 (HDM2) MDM2-MDMX p53-Binding Protein MDM2 | p53-binding protein
Type:
Oncoprotein
Mol. Mass.:
55196.54
Organism:
Homo sapiens (Human)
Description:
Q00987
Residue:
491
  
Inhibitor
Name:
BDBM50339387
Synonyms:
(+/-)-4-((1-(4-chlorophenyl)-1-((1-(hydroxymethyl)cyclopropyl)methoxy)-3-oxoisoindolin-2-yl)methyl)benzamide | CHEMBL1688292
Type:
Small organic molecule
Emp. Form.:
C27H25ClN2O4
Mol. Mass.:
476.951
SMILES:
NC(=O)c1ccc(CN2C(=O)c3ccccc3C2(OCC2(CO)CC2)c2ccc(Cl)cc2)cc1
: