Target
Carbonic anhydrase
Ligand
BDBM50339601
Substrate
Meas. Tech.
ChEMBL_736722 (CHEMBL1695103)
Ki
850±n/a nM
Citation
 Davis, RAHofmann, AOsman, AHall, RAMühlschlegel, FAVullo, DInnocenti, ASupuran, CTPoulsen, SA Natural product-based phenols as novel probes for mycobacterial and fungal carbonic anhydrases. J Med Chem 54:1682-92 (2011)  
Target
Name:
Carbonic anhydrase
Synonyms:
PROBABLE TRANSMEMBRANE CARBONIC ANHYDRASE (CARBONATE DEHYDRATASE) (CARBONIC DEHYDRATASE)
Type:
PROTEIN
Mol. Mass.:
80567.22
Organism:
Mycobacterium tuberculosis
Description:
ChEMBL_878775
Residue:
764
  
Inhibitor
Name:
BDBM50339601
Synonyms:
2-(3-chloro-4-hydroxyphenyl)-N-(4-sulfamoylphenethyl)acetamide CHEMBL606453
Type:
Small organic molecule
Emp. Form.:
C16H17ClN2O4S
Mol. Mass.:
368.835
SMILES:
NS(=O)(=O)c1ccc(CCNC(=O)Cc2ccc(O)c(Cl)c2)cc1
: