Target
Carbonic anhydrase
Ligand
BDBM50339598
Substrate
Meas. Tech.
ChEMBL_736725 (CHEMBL1695106)
Ki
810±n/a nM
Citation
 Davis, RAHofmann, AOsman, AHall, RAMühlschlegel, FAVullo, DInnocenti, ASupuran, CTPoulsen, SA Natural product-based phenols as novel probes for mycobacterial and fungal carbonic anhydrases. J Med Chem 54:1682-92 (2011)  
Target
Name:
Carbonic anhydrase
Synonyms:
Carbonic Anhydrase 2 (Can2)
Type:
Enzyme
Mol. Mass.:
26594.37
Organism:
Cryptococcus neoformans var. grubii (Filobasidiella neoformans var. grubii)
Description:
Residue:
239
  
Inhibitor
Name:
BDBM50339598
Synonyms:
2-(3-chloro-4-hydroxyphenyl)-N-phenethylacetamide | CHEMBL601464
Type:
Small organic molecule
Emp. Form.:
C16H16ClNO2
Mol. Mass.:
289.757
SMILES:
Oc1ccc(CC(=O)NCCc2ccccc2)cc1Cl
: