Target
Carbonic anhydrase
Ligand
BDBM50339600
Substrate
Meas. Tech.
ChEMBL_736725 (CHEMBL1695106)
Ki
860±n/a nM
Citation
 Davis, RAHofmann, AOsman, AHall, RAMühlschlegel, FAVullo, DInnocenti, ASupuran, CTPoulsen, SA Natural product-based phenols as novel probes for mycobacterial and fungal carbonic anhydrases. J Med Chem 54:1682-92 (2011)  
Target
Name:
Carbonic anhydrase
Synonyms:
Carbonic Anhydrase 2 (Can2)
Type:
Enzyme
Mol. Mass.:
26594.37
Organism:
Cryptococcus neoformans var. grubii (Filobasidiella neoformans var. grubii)
Description:
Residue:
239
  
Inhibitor
Name:
BDBM50339600
Synonyms:
2-(3-chloro-4-hydroxyphenyl)-N-(3,4-dimethoxyphenethyl)acetamide | CHEMBL589604
Type:
Small organic molecule
Emp. Form.:
C18H20ClNO4
Mol. Mass.:
349.809
SMILES:
COc1ccc(CCNC(=O)Cc2ccc(O)c(Cl)c2)cc1OC
: