Target
RAF proto-oncogene serine/threonine-protein kinase
Ligand
BDBM50339612
Substrate
Meas. Tech.
ChEMBL_734962 (CHEMBL1693569)
IC50
6.2±n/a nM
Target
Name:
RAF proto-oncogene serine/threonine-protein kinase
Synonyms:
C-Raf Protein Kinase RAF RAF1 Raf-1 Serine/threonine-protein kinase C-Raf | cRaf
Type:
Serine/threonine-protein kinase
Mol. Mass.:
73082.52
Organism:
Homo sapiens (Human)
Description:
P04049
Residue:
648
  
Inhibitor
Name:
BDBM50339612
Synonyms:
CHEMBL1688868 | N-[3-(Aminomethyl)-5-(trifluoromethyl)phenyl]-7-({2-[(cyclopropylcarbonyl)amino]pyridin-4-yl}oxy)-1,2,3,4-tetrahydronaphthalene-2-carboxamide
Type:
Small organic molecule
Emp. Form.:
C28H27F3N4O3
Mol. Mass.:
524.5342
SMILES:
NCc1cc(NC(=O)C2CCc3ccc(Oc4ccnc(NC(=O)C5CC5)c4)cc3C2)cc(c1)C(F)(F)F
: