Target
Coagulation factor X
Ligand
BDBM50306134
Substrate
Meas. Tech.
ChEMBL_735257 (CHEMBL1694519)
Ki
2±n/a nM
Citation
 Watson, NSAdams, CBelton, DBrown, DBurns-Kurtis, CLChaudry, LChan, CConvery, MADavies, DEExall, AMHarling, JDIrvine, SIrving, WRKleanthous, SMcLay, IMPateman, AJPatikis, ANRoethke, TJSenger, SStelman, GJToomey, JRWest, RIWhittaker, CZhou, PYoung, RJ The discovery of potent and long-acting oral factor Xa inhibitors with tetrahydroisoquinoline and benzazepine P4 motifs. Bioorg Med Chem Lett 21:1588-92 (2011)  
Target
Name:
Coagulation factor X
Synonyms:
Activated coagulation factor X (FXa) Coagulation factor X precursor F10 Factor X heavy chain Factor Xa Stuart-Prower factor
Type:
Enzyme
Mol. Mass.:
54726.60
Organism:
Homo sapiens (Human)
Description:
Residue:
488
  
Inhibitor
Name:
BDBM50306134
Synonyms:
6-chloro-N-((S)-1-(2-fluoro-4-((S)-1-(methylamino)ethyl)phenyl)-2-oxopyrrolidin-3-yl)naphthalene-2-sulfonamide | CHEMBL605294
Type:
Small organic molecule
Emp. Form.:
C23H23ClFN3O3S
Mol. Mass.:
475.963
SMILES:
CN[C@@H](C)c1ccc(N2CC[C@H](NS(=O)(=O)c3ccc4cc(Cl)ccc4c3)C2=O)c(F)c1
: