Target
Prostaglandin D2 receptor 2
Ligand
BDBM50339765
Substrate
Meas. Tech.
ChEMBL_735525 (CHEMBL1693030)
IC50
28±n/a nM
Citation
 Luker, TBonnert, RPaine, SWSchmidt, JSargent, CCook, ARCook, AGardiner, PHill, SWeyman-Jones, CPatel, AThom, SThorne, P Zwitterionic CRTh2 antagonists. J Med Chem 54:1779-88 (2011)  
Target
Name:
Prostaglandin D2 receptor 2
Synonyms:
CD_antigen=CD294 Chemoattractant Receptor-homologous molecule expressed on T-helper type 2 cells (CRTH2) Chemoattractant receptor-homologous molecule expressed on Th2 cells (CRTH2) G protein-coupled receptor 44 GPR44 PTGDR2 Prostaglandin D2 receptor 2 | Prostaglandin D2 receptor 2 (PGD2)
Type:
Enzyme
Mol. Mass.:
43295.45
Organism:
Homo sapiens (Human)
Description:
Q9Y5Y4
Residue:
395
  
Inhibitor
Name:
BDBM50339765
Synonyms:
CHEMBL1689122 | rac-2-(4-chloro-2-((2-methyl-4-(phenylsulfonyl)piperazin-1-yl)methyl)phenoxy)acetic acid
Type:
Small organic molecule
Emp. Form.:
C20H23ClN2O5S
Mol. Mass.:
438.925
SMILES:
CC1CN(CCN1Cc1cc(Cl)ccc1OCC(O)=O)S(=O)(=O)c1ccccc1
: