Target
Carbonic anhydrase 12
Ligand
BDBM50334346
Substrate
Meas. Tech.
ChEMBL_735542 (CHEMBL1693047)
Ki
4.6±n/a nM
Citation
 Pacchiano, FCarta, FMcDonald, PCLou, YVullo, DScozzafava, ADedhar, SSupuran, CT Ureido-substituted benzenesulfonamides potently inhibit carbonic anhydrase IX and show antimetastatic activity in a model of breast cancer metastasis. J Med Chem 54:1896-902 (2011)  
Target
Name:
Carbonic anhydrase 12
Synonyms:
CA-XII CAH12_HUMAN Carbonic anhydrase Carbonic anhydrase XII Carbonic anhydrase XII (CAXII) | Tumor antigen HOM-RCC-3.1.3
Type:
Enzyme
Mol. Mass.:
39456.00
Organism:
Homo sapiens (Human)
Description:
Catalytic domain of human cloned isozyme was used in the assay
Residue:
354
  
Inhibitor
Name:
BDBM50334346
Synonyms:
4-(3-(2-cyanophenyl)ureido)benzenesulfonamide CA IX inhibitor, (C)3 | CHEMBL1643301
Type:
Small organic molecule
Emp. Form.:
C14H12N4O3S
Mol. Mass.:
316.335
SMILES:
NS(=O)(=O)c1ccc(NC(=O)Nc2ccccc2C#N)cc1
: