Target
Carbonic anhydrase 2
Ligand
BDBM50334347
Substrate
Meas. Tech.
ChEMBL_735540 (CHEMBL1693045)
Ki
85±n/a nM
Citation
 Pacchiano, FCarta, FMcDonald, PCLou, YVullo, DScozzafava, ADedhar, SSupuran, CT Ureido-substituted benzenesulfonamides potently inhibit carbonic anhydrase IX and show antimetastatic activity in a model of breast cancer metastasis. J Med Chem 54:1896-902 (2011)  
Target
Name:
Carbonic anhydrase 2
Synonyms:
CA-II CAC Carbonate dehydratase II Carbonic anhydrase 2 (CA-II) Carbonic anhydrase C Carbonic anhydrase II (CA-II) Carbonic anhydrase II (hCA II) | Carbonic anhydrase isoenzyme II (hCA II)
Type:
Enzyme
Mol. Mass.:
29250.71
Organism:
Homo sapiens (Human)
Description:
P00918
Residue:
260
  
Inhibitor
Name:
BDBM50334347
Synonyms:
4-(3-(4-phenoxyphenyl)ureido)benzenesulfonamide CHEMBL1643302
Type:
Small organic molecule
Emp. Form.:
C19H17N3O4S
Mol. Mass.:
383.421
SMILES:
NS(=O)(=O)c1ccc(NC(=O)Nc2ccc(Oc3ccccc3)cc2)cc1
: