Target
Carbonic anhydrase 9
Ligand
BDBM50334349
Substrate
Meas. Tech.
ChEMBL_735541 (CHEMBL1693046)
Ki
0.90±n/a nM
Citation
 Pacchiano, FCarta, FMcDonald, PCLou, YVullo, DScozzafava, ADedhar, SSupuran, CT Ureido-substituted benzenesulfonamides potently inhibit carbonic anhydrase IX and show antimetastatic activity in a model of breast cancer metastasis. J Med Chem 54:1896-902 (2011)  
Target
Name:
Carbonic anhydrase 9
Synonyms:
CA-IX CAH9_HUMAN Carbonic anhydrase 9 (CA IX) Carbonic anhydrase 9 precursor Carbonic anhydrase IX (CAIX) Carbonic anhydrases; II & IX MN RCC-associated antigen G250
Type:
Enzyme
Mol. Mass.:
49669.03
Organism:
Homo sapiens (Human)
Description:
Catalytic domain of human cloned isozyme was used in the assay
Residue:
459
  
Inhibitor
Name:
BDBM50334349
Synonyms:
4-(3-(3-nitrophenyl)ureido)benzenesulfonamide 4-{[(3-nitrophenyl)carbamoyl]amino}benzenesulfonamide CHEMBL1614844
Type:
Small organic molecule
Emp. Form.:
C13H12N4O5S
Mol. Mass.:
336.323
SMILES:
NS(=O)(=O)c1ccc(NC(=O)Nc2cccc(c2)[N+]([O-])=O)cc1
: