Target
Bcl-2-like protein 1
Ligand
BDBM50339779
Substrate
Meas. Tech.
ChEMBL_735548 (CHEMBL1693053)
IC50
6±n/a nM
Citation
 Sleebs, BECzabotar, PEFairbrother, WJFairlie, WDFlygare, JAHuang, DCKersten, WJKoehler, MFLessene, GLowes, KParisot, JPSmith, BJSmith, MLSouers, AJStreet, IPYang, HBaell, JB Quinazoline sulfonamides as dual binders of the proteins B-cell lymphoma 2 and B-cell lymphoma extra long with potent proapoptotic cell-based activity. J Med Chem 54:1914-26 (2011)  
Target
Name:
Bcl-2-like protein 1
Synonyms:
Anti-apoptotic Bcl-2 protein Apoptosis regulator Bcl-X BCL2-like 1 isoform 1 BCL2L1 Bcl-2-like protein 1 (Bcl-XL) Bcl-xL/Bcl-2-binding component 3 Bcl2-antagonist of cell death (BAD)
Type:
Mitochondrion membrane; Single-pass membrane protein
Mol. Mass.:
26039.60
Organism:
Homo sapiens (Human)
Description:
Residue:
233
  
Inhibitor
Name:
BDBM50339779
Synonyms:
CHEMBL1689141 | N-{7-[4-(4'-Chloro-biphenyl-2-ylmethyl)piperazin-1-yl]quinazolin-4-yl}-4-((R)-3-dimethylamino-1-phenylsulfanylmethyl-propylamino)-3-trifluoromethanesulfonyl-benzenesulfonamide
Type:
Small organic molecule
Emp. Form.:
C44H45ClF3N7O4S3
Mol. Mass.:
924.516
SMILES:
CN(C)CC[C@H](CSc1ccccc1)Nc1ccc(cc1S(=O)(=O)C(F)(F)F)S(=O)(=O)Nc1ncnc2cc(ccc12)N1CCN(Cc2ccccc2-c2ccc(Cl)cc2)CC1
: