Target
Serine/threonine-protein kinase Nek2
Ligand
BDBM50339798
Substrate
Meas. Tech.
ChEMBL_735640 (CHEMBL1693342)
IC50
>50000±n/a nM
Citation
 Solanki, SInnocenti, PMas-Droux, CBoxall, KBarillari, Cvan Montfort, RLAherne, GWBayliss, RHoelder, S Benzimidazole inhibitors induce a DFG-out conformation of never in mitosis gene A-related kinase 2 (Nek2) without binding to the back pocket and reveal a nonlinear structure-activity relationship. J Med Chem 54:1626-39 (2011)  
Target
Name:
Serine/threonine-protein kinase Nek2
Synonyms:
NEK kinase NEK2A NLK1
Type:
Enzyme
Mol. Mass.:
51776.96
Organism:
Homo sapiens (Human)
Description:
P51955
Residue:
445
  
Inhibitor
Name:
BDBM50339798
Synonyms:
(+/-)-5-(1H-Benzo[d]imidazol-1-yl)-3-(1-(2-(trifluoromethyl)phenyl)ethoxy)thiophene-2-carboxamide | CHEMBL1689163
Type:
Small organic molecule
Emp. Form.:
C21H16F3N3O2S
Mol. Mass.:
431.431
SMILES:
CC(Oc1cc(sc1C(N)=O)-n1cnc2ccccc12)c1ccccc1C(F)(F)F
: