Target
Serine/threonine-protein kinase Nek2
Ligand
BDBM50339801
Substrate
Meas. Tech.
ChEMBL_735640 (CHEMBL1693342)
IC50
360±n/a nM
Citation
 Solanki, SInnocenti, PMas-Droux, CBoxall, KBarillari, Cvan Montfort, RLAherne, GWBayliss, RHoelder, S Benzimidazole inhibitors induce a DFG-out conformation of never in mitosis gene A-related kinase 2 (Nek2) without binding to the back pocket and reveal a nonlinear structure-activity relationship. J Med Chem 54:1626-39 (2011)  
Target
Name:
Serine/threonine-protein kinase Nek2
Synonyms:
NEK kinase NEK2A NLK1
Type:
Enzyme
Mol. Mass.:
51776.96
Organism:
Homo sapiens (Human)
Description:
P51955
Residue:
445
  
Inhibitor
Name:
BDBM50339801
Synonyms:
(R)-4-(5-(1-Methylpiperidin-4-yloxy)-1H-benzo[d]imidazol-1-yl)-2-(1-(2-(trifluoromethyl)phenyl)ethoxy)benzamide CHEMBL1615277
Type:
Small organic molecule
Emp. Form.:
C29H29F3N4O3
Mol. Mass.:
538.5608
SMILES:
C[C@@H](Oc1cc(ccc1C(N)=O)-n1cnc2cc(OC3CCN(C)CC3)ccc12)c1ccccc1C(F)(F)F
: