Target
11-beta-hydroxysteroid dehydrogenase 1
Ligand
BDBM50339805
Substrate
Meas. Tech.
ChEMBL_735653 (CHEMBL1693468)
IC50
140±n/a nM
Citation
 Gaware, RKhunt, RCzollner, LStanetty, CDa Cunha, TKratschmar, DVOdermatt, AKosma, PJordis, UClassen-Houben, D Synthesis of new glycyrrhetinic acid derived ring A azepanone, 29-urea and 29-hydroxamic acid derivatives as selective 11ß-hydroxysteroid dehydrogenase 2 inhibitors. Bioorg Med Chem 19:1866-80 (2011)  
Target
Name:
11-beta-hydroxysteroid dehydrogenase 1
Synonyms:
11-DH 11-beta-Hydroxysteroid Dehydrogenase 1 (11-beta-HSD1) 11-beta-hydroxysteroid dehydrogenase 1 (11HSD1) Corticosteroid 11-beta-dehydrogenase isozyme 1 (11-beta-HSD-1) Corticosteroid 11-beta-dehydrogenase isozyme 1 (11beta-HSD1) HSD11 HSD11L | SDR26C1
Type:
Enzyme
Mol. Mass.:
32409.16
Organism:
Homo sapiens (Human)
Description:
P28845
Residue:
292
  
Inhibitor
Name:
BDBM50339805
Synonyms:
(3beta,18beta,20beta)-[3-(1,2,4-Oxadiazole-5(2H)-one)]-11-oxoolean-12-en-29-oic acid | CHEMBL1689172
Type:
Small organic molecule
Emp. Form.:
C32H46N2O6
Mol. Mass.:
554.7174
SMILES:
C[C@]12CC[C@@](C)(C[C@H]1C1=CC(=O)[C@@H]3[C@@]4(C)CC[C@H](Oc5nc(=O)o[nH]5)C(C)(C)[C@@H]4CC[C@@]3(C)[C@]1(C)CC2)C(O)=O
: