Target
Sodium-dependent serotonin transporter
Ligand
BDBM50340000
Substrate
Meas. Tech.
ChEMBL_740011 (CHEMBL1763071)
IC50
5700±n/a nM
Citation
 Cheshire, DRÅberg, AAndersson, GMAndrews, GBeaton, HGBirkinshaw, TNBoughton-Smith, NConnolly, SCook, TRCooper, ACooper, SLCox, DDixon, JGensmantel, NHamley, PJHarrison, RHartopp, PKäck, HLeeson, PDLuker, TMete, AMillichip, INicholls, DJPimm, ADSt-Gallay, SAWallace, AV The discovery of novel, potent and highly selective inhibitors of inducible nitric oxide synthase (iNOS). Bioorg Med Chem Lett 21:2468-71 (2011)  
Target
Name:
Sodium-dependent serotonin transporter
Synonyms:
5-HT Transporter 5HTT SC6A4_HUMAN SLC6A4 Serotonin transporter (5HTT) Sodium-dependent serotonin transporter (SERT) | Solute carrier family 6 member 4
Type:
Multi-pass membrane protein
Mol. Mass.:
70322.51
Organism:
Homo sapiens (Human)
Description:
P31645
Residue:
630
  
Inhibitor
Name:
BDBM50340000
Synonyms:
(R)-4-methoxy-2-(3-(methylamino)-1-phenylpropoxy)benzonitrile oxalate | CHEMBL1762476
Type:
Small organic molecule
Emp. Form.:
C18H20N2O2
Mol. Mass.:
296.3636
SMILES:
CNCC[C@@H](Oc1cc(OC)ccc1C#N)c1ccccc1
: