Target
Cytochrome P450 2D6
Ligand
BDBM50340002
Substrate
Meas. Tech.
ChEMBL_740012 (CHEMBL1763072)
IC50
340±n/a nM
Citation
 Cheshire, DRÅberg, AAndersson, GMAndrews, GBeaton, HGBirkinshaw, TNBoughton-Smith, NConnolly, SCook, TRCooper, ACooper, SLCox, DDixon, JGensmantel, NHamley, PJHarrison, RHartopp, PKäck, HLeeson, PDLuker, TMete, AMillichip, INicholls, DJPimm, ADSt-Gallay, SAWallace, AV The discovery of novel, potent and highly selective inhibitors of inducible nitric oxide synthase (iNOS). Bioorg Med Chem Lett 21:2468-71 (2011)  
Target
Name:
Cytochrome P450 2D6
Synonyms:
CP2D6_HUMAN CYP2DL1 Cytochrome P450 2D6 (CYP2D6) P450-DB1
Type:
Protein
Mol. Mass.:
55774.82
Organism:
Homo sapiens (Human)
Description:
P10635
Residue:
497
  
Inhibitor
Name:
BDBM50340002
Synonyms:
2-[[(1R)-3-Amino-1-phenylpropyl]oxy]-4-chloro-5-fluorobenzonitrile oxalate | CHEMBL1762479
Type:
Small organic molecule
Emp. Form.:
C16H14ClFN2O
Mol. Mass.:
304.747
SMILES:
NCC[C@@H](Oc1cc(Cl)c(F)cc1C#N)c1ccccc1
: