Target
Potassium voltage-gated channel subfamily H member 2
Ligand
BDBM50339996
Substrate
Meas. Tech.
ChEMBL_740013 (CHEMBL1763073)
IC50
10000±n/a nM
Citation
 Cheshire, DRÅberg, AAndersson, GMAndrews, GBeaton, HGBirkinshaw, TNBoughton-Smith, NConnolly, SCook, TRCooper, ACooper, SLCox, DDixon, JGensmantel, NHamley, PJHarrison, RHartopp, PKäck, HLeeson, PDLuker, TMete, AMillichip, INicholls, DJPimm, ADSt-Gallay, SAWallace, AV The discovery of novel, potent and highly selective inhibitors of inducible nitric oxide synthase (iNOS). Bioorg Med Chem Lett 21:2468-71 (2011)  
Target
Name:
Potassium voltage-gated channel subfamily H member 2
Synonyms:
1,3-beta-glucan synthase component GLS2 ERG Eag-related protein 1 Ether-a-go-go-related gene (HERG) Ether-a-go-go-related gene potassium channel 1 Ether-a-go-go-related gene potassium channel 1 (hERG1) Ether-a-go-go-related protein 1 H-ERG KCNH2 Potassium voltage-gated channel subfamily H member 2 (hERG) Voltage-gated potassium channel subunit Kv11.1 hERG Potassium Channel 1 | putative potassium channel subunit
Type:
Multi-pass membrane protein
Mol. Mass.:
126672.65
Organism:
Homo sapiens (Human)
Description:
Q12809
Residue:
1159
  
Inhibitor
Name:
BDBM50339996
Synonyms:
(R)-4-chloro-2-(3-(methylamino)-1-phenylpropoxy)benzonitrile hydrochloride | CHEMBL1762472
Type:
Small organic molecule
Emp. Form.:
C17H17ClN2O
Mol. Mass.:
300.783
SMILES:
CNCC[C@@H](Oc1cc(Cl)ccc1C#N)c1ccccc1
: