Target
Nitric oxide synthase, inducible
Ligand
BDBM50340002
Substrate
Meas. Tech.
ChEMBL_740009 (CHEMBL1763069)
IC50
6±n/a nM
Citation
 Cheshire, DRÅberg, AAndersson, GMAndrews, GBeaton, HGBirkinshaw, TNBoughton-Smith, NConnolly, SCook, TRCooper, ACooper, SLCox, DDixon, JGensmantel, NHamley, PJHarrison, RHartopp, PKäck, HLeeson, PDLuker, TMete, AMillichip, INicholls, DJPimm, ADSt-Gallay, SAWallace, AV The discovery of novel, potent and highly selective inhibitors of inducible nitric oxide synthase (iNOS). Bioorg Med Chem Lett 21:2468-71 (2011)  
Target
Name:
Nitric oxide synthase, inducible
Synonyms:
HEP-NOS Inducible NO synthase NOS type II NOS2A Nitric oxide synthase, inducible (iNOS) | iNOS
Type:
Homodimer
Mol. Mass.:
131141.95
Organism:
Homo sapiens (Human)
Description:
P35228
Residue:
1153
  
Inhibitor
Name:
BDBM50340002
Synonyms:
2-[[(1R)-3-Amino-1-phenylpropyl]oxy]-4-chloro-5-fluorobenzonitrile oxalate | CHEMBL1762479
Type:
Small organic molecule
Emp. Form.:
C16H14ClFN2O
Mol. Mass.:
304.747
SMILES:
NCC[C@@H](Oc1cc(Cl)c(F)cc1C#N)c1ccccc1
: