Target
Adenosine receptor A2a
Ligand
BDBM50340052
Substrate
Meas. Tech.
ChEMBL_739869 (CHEMBL1762929)
Ki
0.3±n/a nM
Citation
 Harris, JMNeustadt, BRZhang, HLachowicz, JCohen-Williams, MVarty, GHao, JStamford, AW Potent and selective adenosine A(2A) receptor antagonists: [1,2,4]-triazolo[4,3-c]pyrimidin-3-ones. Bioorg Med Chem Lett 21:2497-501 (2011)  
Target
Name:
Adenosine receptor A2a
Synonyms:
A2A adenosine receptor (hA2A) ADENOSINE A2 ADORA2 Adenosine A2A receptor (A2AAR)
Type:
G Protein-Coupled Receptor (GPCR)
Mol. Mass.:
44716.46
Organism:
Homo sapiens (Human)
Description:
P29274
Residue:
412
  
Inhibitor
Name:
BDBM50340052
Synonyms:
5-amino-2-benzyl-7-vinyl-2H-pyrazolo[4,3-e][1,2,4]triazolo[4,3-c]pyrimidin-3(7H)-one | CHEMBL1762510
Type:
Small organic molecule
Emp. Form.:
C15H13N7O
Mol. Mass.:
307.31
SMILES:
Nc1nc2n(C=C)ncc2c2nn(Cc3ccccc3)c(=O)n12
: