Target
Carbonic anhydrase 1
Ligand
BDBM50340087
Substrate
Meas. Tech.
ChEMBL_739878 (CHEMBL1762938)
Ki
3840±n/a nM
Citation
 Carta, FInnocenti, AHall, RAMühlschlegel, FAScozzafava, ASupuran, CT Carbonic anhydrase inhibitors. Inhibition of the β-class enzymes from the fungal pathogens Candida albicans and Cryptococcus neoformans with branched aliphatic/aromatic carboxylates and their derivatives. Bioorg Med Chem Lett 21:2521-6 (2011)  
Target
Name:
Carbonic anhydrase 1
Synonyms:
CA-I CAB Carbonate dehydratase I Carbonic anhydrase 1 (CA I) Carbonic anhydrase 1 (Recombinant CA I) Carbonic anhydrase B Carbonic anhydrase I (CA I) Carbonic anhydrase I (CAI) Carbonic anhydrase isoenzyme I (hCA I) | hCA
Type:
Enzyme
Mol. Mass.:
28873.37
Organism:
Homo sapiens (Human)
Description:
P00915
Residue:
261
  
Inhibitor
Name:
BDBM50340087
Synonyms:
CHEMBL1762668 | methyl 4-methoxybenzoate
Type:
Small organic molecule
Emp. Form.:
C9H10O3
Mol. Mass.:
166.1739
SMILES:
COC(=O)c1ccc(OC)cc1
: