Target
Carbonic anhydrase 2
Ligand
BDBM50340089
Substrate
Meas. Tech.
ChEMBL_739879 (CHEMBL1762939)
Ki
5750±n/a nM
Citation
 Carta, FInnocenti, AHall, RAMühlschlegel, FAScozzafava, ASupuran, CT Carbonic anhydrase inhibitors. Inhibition of the β-class enzymes from the fungal pathogens Candida albicans and Cryptococcus neoformans with branched aliphatic/aromatic carboxylates and their derivatives. Bioorg Med Chem Lett 21:2521-6 (2011)  
Target
Name:
Carbonic anhydrase 2
Synonyms:
CA-II CAC Carbonate dehydratase II Carbonic anhydrase 2 (CA-II) Carbonic anhydrase C Carbonic anhydrase II (CA-II) Carbonic anhydrase II (hCA II) | Carbonic anhydrase isoenzyme II (hCA II)
Type:
Enzyme
Mol. Mass.:
29250.71
Organism:
Homo sapiens (Human)
Description:
P00918
Residue:
260
  
Inhibitor
Name:
BDBM50340089
Synonyms:
4-methoxybenzohydrazide | CHEMBL1588015
Type:
Small organic molecule
Emp. Form.:
C8H10N2O2
Mol. Mass.:
166.1772
SMILES:
COc1ccc(cc1)C(=O)NN
: