Target
Polyphenol oxidase 2
Ligand
BDBM50247599
Substrate
Meas. Tech.
ChEMBL_739884 (CHEMBL1762944)
IC50
10060000±n/a nM
Citation
 Liu, JWu, FChen, LHu, JZhao, LChen, CPeng, L Evaluation of dihydropyrimidin-(2H)-one analogues and rhodanine derivatives as tyrosinase inhibitors. Bioorg Med Chem Lett 21:2376-9 (2011)  
Target
Name:
Polyphenol oxidase 2
Synonyms:
Monophenol monooxygenase PPO2 Tyrosinase
Type:
Protein
Mol. Mass.:
63923.66
Organism:
Agaricus bisporus (Common mushroom)
Description:
O42713
Residue:
556
  
Inhibitor
Name:
BDBM50247599
Synonyms:
(Z)-5-(4'-Hydroxybenzylidene)-2-thioxothiazolidin-4-one CHEMBL487697
Type:
Small organic molecule
Emp. Form.:
C10H7NO2S2
Mol. Mass.:
237.298
SMILES:
Oc1ccc(C=C2SC(S)=NC2=O)cc1
: