Target
Cytochrome P450 2E1
Ligand
BDBM50340099
Substrate
Meas. Tech.
ChEMBL_741103 (CHEMBL1764374)
IC50
>100000±n/a nM
Citation
 Ratcliffe, PAdam, JMBaker, JBursi, RCampbell, RClark, JKCottney, JEDeehan, MEasson, AMEcker, DEdwards, DEpemolu, OEvans, LFields, RFrancis, SHarradine, PJeremiah, FKiyoi, TMcArthur, DMorrison, APassier, PPick, JSchnabel, PGSchulz, JSteinbrede, HWalker, GWestwood, PWishart, Gde Haes, JU Design, synthesis and structure-activity relationships of (indo-3-yl) heterocyclic derivatives as agonists of the CB1 receptor. Discovery of a clinical candidate. Bioorg Med Chem Lett 21:2541-6 (2011)  
Target
Name:
Cytochrome P450 2E1
Synonyms:
CP2E1_HUMAN CYP2E1 | Cytochrome P450 2E1 (CYP2E1)
Type:
Enzyme
Mol. Mass.:
56860.34
Organism:
Homo sapiens (Human)
Description:
P05181
Residue:
493
  
Inhibitor
Name:
BDBM50340099
Synonyms:
2-(((2-(7-chloro-1-((tetrahydro-2H-pyran-4-yl)methyl)-1H-indol-3-yl)thiazol-4-yl)methyl)(isopropyl)amino)ethanol | CHEMBL1762808
Type:
Small organic molecule
Emp. Form.:
C23H30ClN3O2S
Mol. Mass.:
448.021
SMILES:
CC(C)N(CCO)Cc1csc(n1)-c1cn(CC2CCOCC2)c2c(Cl)cccc12
: