Target
Toll-like receptor 7
Ligand
BDBM50340220
Substrate
Meas. Tech.
ChEMBL_741445 (CHEMBL1763704)
EC50
50±n/a nM
Citation
 Tran, TDPryde, DCJones, PAdam, FMBenson, NBish, GCalo, FCiaramella, GDixon, RDuckworth, JFox, DNHay, DAHitchin, JHorscroft, NHoward, MGardner, IJones, HMLaxton, CParkinson, TParsons, GProctor, KSmith, MCSmith, NThomas, A Design and optimisation of orally active TLR7 agonists for the treatment of hepatitis C virus infection. Bioorg Med Chem Lett 21:2389-93 (2011)  
Target
Name:
Toll-like receptor 7
Synonyms:
ORF Names:UNQ248/PRO285 TLR7_HUMAN | Toll-like receptor 7 (TLR7)
Type:
Enzyme
Mol. Mass.:
120945.35
Organism:
Homo sapiens (Human)
Description:
Q9NYK1
Residue:
1049
  
Inhibitor
Name:
BDBM50340220
Synonyms:
4-amino-1-((6-methylpyridin-3-yl)methyl)-6-(trifluoromethyl)-1H-imidazo[4,5-c]pyridin-2(3H)-one | CHEMBL1760437
Type:
Small organic molecule
Emp. Form.:
C14H12F3N5O
Mol. Mass.:
323.2732
SMILES:
Cc1ccc(Cn2c3cc(nc(N)c3[nH]c2=O)C(F)(F)F)cn1
: